{"text_format":"3","workbook":"xlsx","n_sheets":5,"sheets":["Export Pop pour part d'offre","Clusters","Indice offres","Indice EP","Simulateur 2019 NRJ Global"],"not_rendered":{"images":4,"macros":1,"defined_names":3},"read":"whole","date_system":"1900"}

{"sheet":"Export Pop pour part d'offre","index":0,"n_rows":85,"n_cols":9,"rows_kept":85,"hidden":true,"merged":[[0,1,0,4],[1,1,1,4],[2,1,2,4],[3,1,3,4],[5,0,5,1],[83,1,83,4],[84,1,84,4]]}
[null,"Offre croisée"]
[null,"Période : du 01 /01 /2017 au 31 /12 /2018"]
[null,"Chaînes : NRJHI NRJ12 CH25"]
[null,"Jours : Lundi, Mardi, Mercredi, Jeudi, Vendredi, Samedi, Dimanche"]
[]
["Total","Total","NRJ 12","CHERIE 25","NRJ Hits"]
["Total","GRP moy -H100000",0.263799,0.200877,null,{"$f":"C7/SUM($C7:$E7)","v":{"v":0.5677052397799758,"d":"57%"}},{"$f":"D7/SUM($C7:$E7)","v":{"v":0.4322947602200243,"d":"43%"}},{"v":0,"d":"0%"},{"$f":"+SUM(F7:H7)","v":{"v":1,"d":"100%"}}]
["Total","GRP moy E49EF",0.262724,0.106472,{"v":0.04767,"d":"0.047670"},{"$f":"C8/SUM($C8:$E8)","v":{"v":0.6302360950521271,"d":"63%"}},{"$f":"D8/SUM($C8:$E8)","v":{"v":0.25541061156342804,"d":"26%"}},{"$f":"E8/SUM($C8:$E8)","v":{"v":0.11435329338444487,"d":"11%"}},{"$f":"+SUM(F8:H8)","v":{"v":1,"d":"100%"}}]
["Total","GRP moy ACTIFS",0.263089,0.152485,0.033041,{"v":0.5864471763093075,"d":"59%"},{"v":0.33990169744658566,"d":"34%"},{"v":0.07365112624410687,"d":"7%"},{"v":1,"d":"100%"}]
["Total","GRP moy CSP+",0.202547,0.108094,0.033731,{"v":0.5881633814595844,"d":"59%"},{"v":0.3138873079112123,"d":"31%"},{"v":0.0979493106292033,"d":"10%"},{"v":1,"d":"100%"}]
["Total","GRP moy ENF11A14",{"v":0.18713,"d":"0.187130"},0.054059,{"v":0.01998,"d":"0.019980"},{"v":0.7165092334848316,"d":"72%"},{"v":0.20698857827690118,"d":"21%"},{"v":0.07650218823826718,"d":"8%"},{"v":1,"d":"100%"}]
["Total","GRP moy ENF4A10",0.081763,{"v":0.03234,"d":"0.032340"},0.034757,{"v":0.5492610506516189,"d":"55%"},{"v":0.21725110842402254,"d":"22%"},{"v":0.23348784092435845,"d":"23%"},{"v":0.9999999999999999,"d":"100%"}]
["Total","GRP moy ENF4A14",0.120752,0.040405,0.029199,{"v":0.634348273760743,"d":"63%"},{"v":0.21226018617747802,"d":"21%"},{"v":0.153391540061779,"d":"15%"},{"v":1,"d":"100%"}]
["Total","GRP moy ENF4A14C",0.120665,0.040357,null,{"v":0.7493696513519892,"d":"75%"},{"v":0.2506303486480108,"d":"25%"},{"v":0,"d":"0%"},{"v":1,"d":"100%"}]
["Total","GRP moy ENS1124",0.211987,0.066462,0.028078,{"v":0.6915769247081008,"d":"69%"},{"v":0.21682266162524017,"d":"22%"},{"v":0.09160041366665905,"d":"9%"},{"v":1,"d":"100%"}]
{"$rows_left_out":71}
{"sheet":"Clusters","index":1,"n_rows":39,"n_cols":22,"rows_kept":39,"hidden":true}
["Libellé","Libellé Popcorn","Libellé BO","Cluster","Day","Access","Peak","Night","NRJ12","CH25","NRJ Hits","NRJ12","CH25","NRJ Hits",null,null,"NRJ12","CH25","NRJ Hits","Libellé offre",null,"TH cluster"]
["Femmes RDA avec enfant(s)","MENENF","TV_MEN_ENF","Femmes",85,110,130,80,"R","R","R",{"$f":"VLOOKUP(\"GRP moy \"&$B2,'Export Pop pour part d''offre'!$B:$G,5,FALSE)","v":{"v":0.6302542231814346,"d":"63%"}},{"$f":"VLOOKUP(\"GRP moy \"&$B2,'Export Pop pour part d''offre'!$B:$G,6,FALSE)","v":{"v":0.2654161189780561,"d":"27%"}},{"$f":"VLOOKUP(\"GRP moy \"&$B2,'Export Pop pour part d''offre'!$B:$H,7,FALSE)","v":{"v":0.10432965784050925,"d":"10%"}},"ouiouioui",null,"oui",{"$f":"IF('Simulateur 2019 NRJ Global'!C5=\"Millennials\",\"non disponible\",\"oui\")","v":"oui"},{"$f":"IF('Simulateur 2019 NRJ Global'!C5=\"Mixtes\",\"non disponible\",\"oui\")","v":"oui"},"Global",100,{"$f":"VLOOKUP('Simulateur 2019 NRJ Global'!$C$5,Clusters!$D:$H,2,FALSE)","v":85}]
["Femmes 25-49 ans","FEM2549","TV_F25-49","Femmes",85,110,130,80,"R","R","R",{"$f":"VLOOKUP(\"GRP moy \"&$B3,'Export Pop pour part d''offre'!$B:$G,5,FALSE)","v":{"v":0.6077680308364047,"d":"61%"}},{"$f":"VLOOKUP(\"GRP moy \"&$B3,'Export Pop pour part d''offre'!$B:$G,6,FALSE)","v":{"v":0.2967642107475967,"d":"30%"}},{"$f":"VLOOKUP(\"GRP moy \"&$B3,'Export Pop pour part d''offre'!$B:$H,7,FALSE)","v":{"v":0.09546775841599854,"d":"10%"}},"ouiouioui",null,"non",{"$f":"IF('Simulateur 2019 NRJ Global'!C5=\"Millennials\",\"non disponible\",\"non\")","v":"non"},{"$f":"IF('Simulateur 2019 NRJ Global'!C5=\"Mixtes\",\"non disponible\",\"non\")","v":"non"},"Global Plus",105,{"$f":"VLOOKUP('Simulateur 2019 NRJ Global'!$C$5,Clusters!$D:$H,3,FALSE)","v":110}]
["Femmes 35-59 ans","FEM3559","TV_F35-59","Femmes",85,110,130,80,"R","R","R",{"$f":"VLOOKUP(\"GRP moy \"&$B4,'Export Pop pour part d''offre'!$B:$G,5,FALSE)","v":{"v":0.5191911264089568,"d":"52%"}},{"$f":"VLOOKUP(\"GRP moy \"&$B4,'Export Pop pour part d''offre'!$B:$G,6,FALSE)","v":{"v":0.40722634087298587,"d":"41%"}},{"$f":"VLOOKUP(\"GRP moy \"&$B4,'Export Pop pour part d''offre'!$B:$H,7,FALSE)","v":{"v":0.07358253271805734,"d":"7%"}},"ouiouioui",null,107,102,95,"Global Max",108,{"$f":"VLOOKUP('Simulateur 2019 NRJ Global'!$C$5,Clusters!$D:$H,4,FALSE)","v":130}]
["Femmes 25-59 ans","FEM2559","TV_FEM2559","Femmes",85,110,130,80,"R","R","R",{"$f":"VLOOKUP(\"GRP moy \"&$B5,'Export Pop pour part d''offre'!$B:$G,5,FALSE)","v":{"v":0.556471375567125,"d":"56%"}},{"$f":"VLOOKUP(\"GRP moy \"&$B5,'Export Pop pour part d''offre'!$B:$G,6,FALSE)","v":{"v":0.35765368553310567,"d":"36%"}},{"$f":"VLOOKUP(\"GRP moy \"&$B5,'Export Pop pour part d''offre'!$B:$H,7,FALSE)","v":{"v":0.08587493889976938,"d":"9%"}},"ouiouioui",null,100,100,100,null,null,{"$f":"VLOOKUP('Simulateur 2019 NRJ Global'!$C$5,Clusters!$D:$H,5,FALSE)","v":80}]
["Femmes RDA avec enfant(s) -25 ans","Mnef-25","TV_MEN_E-25","Femmes",85,110,130,80,"R","R","R",{"$f":"VLOOKUP(\"GRP moy \"&$B6,'Export Pop pour part d''offre'!$B:$G,5,FALSE)","v":{"v":0.5870916411149119,"d":"59%"}},{"$f":"VLOOKUP(\"GRP moy \"&$B6,'Export Pop pour part d''offre'!$B:$G,6,FALSE)","v":{"v":0.3163974886978481,"d":"32%"}},{"$f":"VLOOKUP(\"GRP moy \"&$B6,'Export Pop pour part d''offre'!$B:$H,7,FALSE)","v":{"v":0.09651087018724007,"d":"10%"}},"ouiouioui"]
["Femmes RDA -50 ans","MEN<50","TV_MEN15-49","Femmes",85,110,130,80,"R","R","R",{"$f":"VLOOKUP(\"GRP moy \"&$B7,'Export Pop pour part d''offre'!$B:$G,5,FALSE)","v":{"v":0.6192166617623914,"d":"62%"}},{"$f":"VLOOKUP(\"GRP moy \"&$B7,'Export Pop pour part d''offre'!$B:$G,6,FALSE)","v":{"v":0.2910812900753434,"d":"29%"}},{"$f":"VLOOKUP(\"GRP moy \"&$B7,'Export Pop pour part d''offre'!$B:$H,7,FALSE)","v":{"v":0.08970204816226537,"d":"9%"}},"ouiouioui",null,"Offre"]
["Femmes RDA 25-59 ans","MEN2559","TV_MEN_25-59","Femmes",85,110,130,80,"R","R","R",{"$f":"VLOOKUP(\"GRP moy \"&$B8,'Export Pop pour part d''offre'!$B:$G,5,FALSE)","v":{"v":0.5561220562102657,"d":"56%"}},{"$f":"VLOOKUP(\"GRP moy \"&$B8,'Export Pop pour part d''offre'!$B:$G,6,FALSE)","v":{"v":0.3565618203863253,"d":"36%"}},{"$f":"VLOOKUP(\"GRP moy \"&$B8,'Export Pop pour part d''offre'!$B:$H,7,FALSE)","v":{"v":0.08731612340340905,"d":"9%"}},"ouiouioui",null,"NRJ12","CH25","NRJ Hits"]
["Femmes 35-49 ans","FEM3549","TV_F35-49","Femmes",85,110,130,80,"R","R","R",{"$f":"VLOOKUP(\"GRP moy \"&$B9,'Export Pop pour part d''offre'!$B:$G,5,FALSE)","v":{"v":0.567858879325787,"d":"57%"}},{"$f":"VLOOKUP(\"GRP moy \"&$B9,'Export Pop pour part d''offre'!$B:$G,6,FALSE)","v":{"v":0.3565122448457345,"d":"36%"}},{"$f":"VLOOKUP(\"GRP moy \"&$B9,'Export Pop pour part d''offre'!$B:$H,7,FALSE)","v":{"v":0.07562887582847833,"d":"8%"}},"ouiouioui",{"$f":"'Simulateur 2019 NRJ Global'!$C$3","v":"Femmes 25-49 ans"},{"$f":"VLOOKUP('Simulateur 2019 NRJ Global'!$C$3,Clusters!$A:$N,12,FALSE)","v":{"v":0.6077680308364047,"d":"61%"}},{"$f":"VLOOKUP('Simulateur 2019 NRJ Global'!$C$3,Clusters!$A:$N,13,FALSE)","v":{"v":0.2967642107475967,"d":"30%"}},{"$f":"VLOOKUP('Simulateur 2019 NRJ Global'!$C$3,Clusters!$A:$N,14,FALSE)","v":{"v":0.09546775841599854,"d":"10%"}}]
["Femmes RDA","MENAGERE","TV_MEN","Femmes",85,110,130,80,"R","R","R",{"$f":"VLOOKUP(\"GRP moy \"&$B10,'Export Pop pour part d''offre'!$B:$G,5,FALSE)","v":{"v":0.4921051627692447,"d":"49%"}},{"$f":"VLOOKUP(\"GRP moy \"&$B10,'Export Pop pour part d''offre'!$B:$G,6,FALSE)","v":{"v":0.4494126990182173,"d":"45%"}},{"$f":"VLOOKUP(\"GRP moy \"&$B10,'Export Pop pour part d''offre'!$B:$H,7,FALSE)","v":{"v":0.05848213821253811,"d":"6%"}},"ouiouioui","Selection chaînes",{"$f":"'Simulateur 2019 NRJ Global'!C15","v":"oui"},{"$f":"'Simulateur 2019 NRJ Global'!D15","v":"oui"},{"$f":"'Simulateur 2019 NRJ Global'!E15","v":"oui"}]
["Femmes 25 ans et +","FEM>25","TV_FEM>25","Femmes",85,110,130,80,"R","R","R",{"$f":"VLOOKUP(\"GRP moy \"&$B11,'Export Pop pour part d''offre'!$B:$G,5,FALSE)","v":{"v":0.4878564599268374,"d":"49%"}},{"$f":"VLOOKUP(\"GRP moy \"&$B11,'Export Pop pour part d''offre'!$B:$G,6,FALSE)","v":{"v":0.45204765269925734,"d":"45%"}},{"$f":"VLOOKUP(\"GRP moy \"&$B11,'Export Pop pour part d''offre'!$B:$H,7,FALSE)","v":{"v":0.06009588737390533,"d":"6%"}},"ouiouioui",null,{"$f":"IF(OR(Q10=\"non disponible\",Q10=\"non\"),0,Q9)","v":{"v":0.6077680308364047,"d":"61%"}},{"$f":"IF(OR(R10=\"non disponible\",R10=\"non\"),0,R9)","v":{"v":0.2967642107475967,"d":"30%"}},{"$f":"IF(OR(S10=\"non disponible\",S10=\"non\"),0,S9)","v":{"v":0.09546775841599854,"d":"10%"}}]
["Femmes avec enfant(s) -6 ans","Fm-ef-6a","TV_Fm-ef-6a","Femmes",85,110,130,80,"R","R","R",{"$f":"VLOOKUP(\"GRP moy \"&$B12,'Export Pop pour part d''offre'!$B:$G,5,FALSE)","v":{"v":0.7507319570039243,"d":"75%"}},{"$f":"VLOOKUP(\"GRP moy \"&$B12,'Export Pop pour part d''offre'!$B:$G,6,FALSE)","v":{"v":0.24926804299607577,"d":"25%"}},{"$f":"VLOOKUP(\"GRP moy \"&$B12,'Export Pop pour part d''offre'!$B:$H,7,FALSE)","v":{"v":0,"d":"0%"}},"ouiouioui","Offre résultante",{"$f":"IFERROR(Q11/SUM($Q$11:$S$11),\"% incorrects\")","v":{"v":0.6077680308364048,"d":"61%"}},{"$f":"IFERROR(R11/SUM($Q$11:$S$11),\"% incorrects\")","v":{"v":0.29676421074759674,"d":"30%"}},{"$f":"IFERROR(S11/SUM($Q$11:$S$11),\"% incorrects\")","v":{"v":0.09546775841599855,"d":"10%"}}]
["Femmes avec enfant(s) 3-8 ans","CMen3-8","TV_CMen3-8","Femmes",85,110,130,80,"R","R","R",{"$f":"VLOOKUP(\"GRP moy \"&$B13,'Export Pop pour part d''offre'!$B:$G,5,FALSE)","v":{"v":0.6123446428481684,"d":"61%"}},{"$f":"VLOOKUP(\"GRP moy \"&$B13,'Export Pop pour part d''offre'!$B:$G,6,FALSE)","v":{"v":0.2567784216266201,"d":"26%"}},{"$f":"VLOOKUP(\"GRP moy \"&$B13,'Export Pop pour part d''offre'!$B:$H,7,FALSE)","v":{"v":0.13087693552521143,"d":"13%"}},"ouiouioui"]
["Femmes 15-49 ans","FEM15-49","TV_F15-49","Femmes",85,110,130,80,"R","R","R",{"$f":"VLOOKUP(\"GRP moy \"&$B14,'Export Pop pour part d''offre'!$B:$G,5,FALSE)","v":{"v":0.6241888252865782,"d":"62%"}},{"$f":"VLOOKUP(\"GRP moy \"&$B14,'Export Pop pour part d''offre'!$B:$G,6,FALSE)","v":{"v":0.27509307356122253,"d":"28%"}},{"$f":"VLOOKUP(\"GRP moy \"&$B14,'Export Pop pour part d''offre'!$B:$H,7,FALSE)","v":{"v":0.10071810115219917,"d":"10%"}},"ouiouioui"]
["Femmes 15-34 ans","FEM<35","TV_F15-34","Millennials",85,130,110,80,"R","X","R",{"$f":"VLOOKUP(\"GRP moy \"&$B15,'Export Pop pour part d''offre'!$B:$G,5,FALSE)","v":{"v":0.680682912201512,"d":"68%"}},{"$f":"VLOOKUP(\"GRP moy \"&$B15,'Export Pop pour part d''offre'!$B:$G,6,FALSE)","v":{"v":0.19342931771910166,"d":"19%"}},{"$f":"VLOOKUP(\"GRP moy \"&$B15,'Export Pop pour part d''offre'!$B:$H,7,FALSE)","v":{"v":0.1258877700793864,"d":"13%"}},"ouinon disponibleoui"]
{"$rows_left_out":25}
{"sheet":"Indice offres","index":2,"n_rows":5,"n_cols":16,"rows_kept":5,"hidden":true}
[null,"P1","P2","P3","P4","P5","P6","P7","P8","P9","P10","P11","P12","P13","P14","P15"]
["Poids Prime",{"$f":"IF(OR('Simulateur 2019 NRJ Global'!C30<>\"\",AND('Simulateur 2019 NRJ Global'!C30=\"\",SUM('Simulateur 2019 NRJ Global'!C28:C31)<>0)),IF('Simulateur 2019 NRJ Global'!C30<=0.2,Clusters!$T$2,IF('Simulateur 2019 NRJ Global'!C30<=0.4,Clusters!$T$3,Clusters!$T$4)),\"\")","v":""},{"$f":"IF(OR('Simulateur 2019 NRJ Global'!D30<>\"\",AND('Simulateur 2019 NRJ Global'!D30=\"\",SUM('Simulateur 2019 NRJ Global'!D28:D31)<>0)),IF('Simulateur 2019 NRJ Global'!D30<=0.2,Clusters!$T$2,IF('Simulateur 2019 NRJ Global'!D30<=0.4,Clusters!$T$3,Clusters!$T$4)),\"\")","v":""},{"$f":"IF(OR('Simulateur 2019 NRJ Global'!E30<>\"\",AND('Simulateur 2019 NRJ Global'!E30=\"\",SUM('Simulateur 2019 NRJ Global'!E28:E31)<>0)),IF('Simulateur 2019 NRJ Global'!E30<=0.2,Clusters!$T$2,IF('Simulateur 2019 NRJ Global'!E30<=0.4,Clusters!$T$3,Clusters!$T$4)),\"\")","v":""},{"$f":"IF(OR('Simulateur 2019 NRJ Global'!F30<>\"\",AND('Simulateur 2019 NRJ Global'!F30=\"\",SUM('Simulateur 2019 NRJ Global'!F28:F31)<>0)),IF('Simulateur 2019 NRJ Global'!F30<=0.2,Clusters!$T$2,IF('Simulateur 2019 NRJ Global'!F30<=0.4,Clusters!$T$3,Clusters!$T$4)),\"\")","v":""},{"$f":"IF(OR('Simulateur 2019 NRJ Global'!G30<>\"\",AND('Simulateur 2019 NRJ Global'!G30=\"\",SUM('Simulateur 2019 NRJ Global'!G28:G31)<>0)),IF('Simulateur 2019 NRJ Global'!G30<=0.2,Clusters!$T$2,IF('Simulateur 2019 NRJ Global'!G30<=0.4,Clusters!$T$3,Clusters!$T$4)),\"\")","v":""},{"$f":"IF(OR('Simulateur 2019 NRJ Global'!H30<>\"\",AND('Simulateur 2019 NRJ Global'!H30=\"\",SUM('Simulateur 2019 NRJ Global'!H28:H31)<>0)),IF('Simulateur 2019 NRJ Global'!H30<=0.2,Clusters!$T$2,IF('Simulateur 2019 NRJ Global'!H30<=0.4,Clusters!$T$3,Clusters!$T$4)),\"\")","v":""},{"$f":"IF(OR('Simulateur 2019 NRJ Global'!I30<>\"\",AND('Simulateur 2019 NRJ Global'!I30=\"\",SUM('Simulateur 2019 NRJ Global'!I28:I31)<>0)),IF('Simulateur 2019 NRJ Global'!I30<=0.2,Clusters!$T$2,IF('Simulateur 2019 NRJ Global'!I30<=0.4,Clusters!$T$3,Clusters!$T$4)),\"\")","v":""},{"$f":"IF(OR('Simulateur 2019 NRJ Global'!J30<>\"\",AND('Simulateur 2019 NRJ Global'!J30=\"\",SUM('Simulateur 2019 NRJ Global'!J28:J31)<>0)),IF('Simulateur 2019 NRJ Global'!J30<=0.2,Clusters!$T$2,IF('Simulateur 2019 NRJ Global'!J30<=0.4,Clusters!$T$3,Clusters!$T$4)),\"\")","v":""},{"$f":"IF(OR('Simulateur 2019 NRJ Global'!K30<>\"\",AND('Simulateur 2019 NRJ Global'!K30=\"\",SUM('Simulateur 2019 NRJ Global'!K28:K31)<>0)),IF('Simulateur 2019 NRJ Global'!K30<=0.2,Clusters!$T$2,IF('Simulateur 2019 NRJ Global'!K30<=0.4,Clusters!$T$3,Clusters!$T$4)),\"\")","v":""},{"$f":"IF(OR('Simulateur 2019 NRJ Global'!L30<>\"\",AND('Simulateur 2019 NRJ Global'!L30=\"\",SUM('Simulateur 2019 NRJ Global'!L28:L31)<>0)),IF('Simulateur 2019 NRJ Global'!L30<=0.2,Clusters!$T$2,IF('Simulateur 2019 NRJ Global'!L30<=0.4,Clusters!$T$3,Clusters!$T$4)),\"\")","v":""},{"$f":"IF(OR('Simulateur 2019 NRJ Global'!M30<>\"\",AND('Simulateur 2019 NRJ Global'!M30=\"\",SUM('Simulateur 2019 NRJ Global'!M28:M31)<>0)),IF('Simulateur 2019 NRJ Global'!M30<=0.2,Clusters!$T$2,IF('Simulateur 2019 NRJ Global'!M30<=0.4,Clusters!$T$3,Clusters!$T$4)),\"\")","v":""},{"$f":"IF(OR('Simulateur 2019 NRJ Global'!N30<>\"\",AND('Simulateur 2019 NRJ Global'!N30=\"\",SUM('Simulateur 2019 NRJ Global'!N28:N31)<>0)),IF('Simulateur 2019 NRJ Global'!N30<=0.2,Clusters!$T$2,IF('Simulateur 2019 NRJ Global'!N30<=0.4,Clusters!$T$3,Clusters!$T$4)),\"\")","v":""},{"$f":"IF(OR('Simulateur 2019 NRJ Global'!O30<>\"\",AND('Simulateur 2019 NRJ Global'!O30=\"\",SUM('Simulateur 2019 NRJ Global'!O28:O31)<>0)),IF('Simulateur 2019 NRJ Global'!O30<=0.2,Clusters!$T$2,IF('Simulateur 2019 NRJ Global'!O30<=0.4,Clusters!$T$3,Clusters!$T$4)),\"\")","v":""},{"$f":"IF(OR('Simulateur 2019 NRJ Global'!P30<>\"\",AND('Simulateur 2019 NRJ Global'!P30=\"\",SUM('Simulateur 2019 NRJ Global'!P28:P31)<>0)),IF('Simulateur 2019 NRJ Global'!P30<=0.2,Clusters!$T$2,IF('Simulateur 2019 NRJ Global'!P30<=0.4,Clusters!$T$3,Clusters!$T$4)),\"\")","v":""},{"$f":"IF(OR('Simulateur 2019 NRJ Global'!Q30<>\"\",AND('Simulateur 2019 NRJ Global'!Q30=\"\",SUM('Simulateur 2019 NRJ Global'!Q28:Q31)<>0)),IF('Simulateur 2019 NRJ Global'!Q30<=0.2,Clusters!$T$2,IF('Simulateur 2019 NRJ Global'!Q30<=0.4,Clusters!$T$3,Clusters!$T$4)),\"\")","v":""}]
["EP",{"$f":"IF('Simulateur 2019 NRJ Global'!C38=\"\",\"\",IF('Simulateur 2019 NRJ Global'!C38<=0.2,Clusters!$T$2,IF('Simulateur 2019 NRJ Global'!C38<=0.4,Clusters!$T$3,Clusters!$T$4)))","v":""},{"$f":"IF('Simulateur 2019 NRJ Global'!D38=\"\",\"\",IF('Simulateur 2019 NRJ Global'!D38<=0.2,Clusters!$T$2,IF('Simulateur 2019 NRJ Global'!D38<=0.4,Clusters!$T$3,Clusters!$T$4)))","v":""},{"$f":"IF('Simulateur 2019 NRJ Global'!E38=\"\",\"\",IF('Simulateur 2019 NRJ Global'!E38<=0.2,Clusters!$T$2,IF('Simulateur 2019 NRJ Global'!E38<=0.4,Clusters!$T$3,Clusters!$T$4)))","v":""},{"$f":"IF('Simulateur 2019 NRJ Global'!F38=\"\",\"\",IF('Simulateur 2019 NRJ Global'!F38<=0.2,Clusters!$T$2,IF('Simulateur 2019 NRJ Global'!F38<=0.4,Clusters!$T$3,Clusters!$T$4)))","v":""},{"$f":"IF('Simulateur 2019 NRJ Global'!G38=\"\",\"\",IF('Simulateur 2019 NRJ Global'!G38<=0.2,Clusters!$T$2,IF('Simulateur 2019 NRJ Global'!G38<=0.4,Clusters!$T$3,Clusters!$T$4)))","v":""},{"$f":"IF('Simulateur 2019 NRJ Global'!H38=\"\",\"\",IF('Simulateur 2019 NRJ Global'!H38<=0.2,Clusters!$T$2,IF('Simulateur 2019 NRJ Global'!H38<=0.4,Clusters!$T$3,Clusters!$T$4)))","v":""},{"$f":"IF('Simulateur 2019 NRJ Global'!I38=\"\",\"\",IF('Simulateur 2019 NRJ Global'!I38<=0.2,Clusters!$T$2,IF('Simulateur 2019 NRJ Global'!I38<=0.4,Clusters!$T$3,Clusters!$T$4)))","v":""},{"$f":"IF('Simulateur 2019 NRJ Global'!J38=\"\",\"\",IF('Simulateur 2019 NRJ Global'!J38<=0.2,Clusters!$T$2,IF('Simulateur 2019 NRJ Global'!J38<=0.4,Clusters!$T$3,Clusters!$T$4)))","v":""},{"$f":"IF('Simulateur 2019 NRJ Global'!K38=\"\",\"\",IF('Simulateur 2019 NRJ Global'!K38<=0.2,Clusters!$T$2,IF('Simulateur 2019 NRJ Global'!K38<=0.4,Clusters!$T$3,Clusters!$T$4)))","v":""},{"$f":"IF('Simulateur 2019 NRJ Global'!L38=\"\",\"\",IF('Simulateur 2019 NRJ Global'!L38<=0.2,Clusters!$T$2,IF('Simulateur 2019 NRJ Global'!L38<=0.4,Clusters!$T$3,Clusters!$T$4)))","v":""},{"$f":"IF('Simulateur 2019 NRJ Global'!M38=\"\",\"\",IF('Simulateur 2019 NRJ Global'!M38<=0.2,Clusters!$T$2,IF('Simulateur 2019 NRJ Global'!M38<=0.4,Clusters!$T$3,Clusters!$T$4)))","v":""},{"$f":"IF('Simulateur 2019 NRJ Global'!N38=\"\",\"\",IF('Simulateur 2019 NRJ Global'!N38<=0.2,Clusters!$T$2,IF('Simulateur 2019 NRJ Global'!N38<=0.4,Clusters!$T$3,Clusters!$T$4)))","v":""},{"$f":"IF('Simulateur 2019 NRJ Global'!O38=\"\",\"\",IF('Simulateur 2019 NRJ Global'!O38<=0.2,Clusters!$T$2,IF('Simulateur 2019 NRJ Global'!O38<=0.4,Clusters!$T$3,Clusters!$T$4)))","v":""},{"$f":"IF('Simulateur 2019 NRJ Global'!P38=\"\",\"\",IF('Simulateur 2019 NRJ Global'!P38<=0.2,Clusters!$T$2,IF('Simulateur 2019 NRJ Global'!P38<=0.4,Clusters!$T$3,Clusters!$T$4)))","v":""},{"$f":"IF('Simulateur 2019 NRJ Global'!Q38=\"\",\"\",IF('Simulateur 2019 NRJ Global'!Q38<=0.2,Clusters!$T$2,IF('Simulateur 2019 NRJ Global'!Q38<=0.4,Clusters!$T$3,Clusters!$T$4)))","v":""}]
["Synthèse",{"$f":"IF(AND(B2=\"\",B3=\"\"),\"\",IF(OR(B2=\"Global Max\",B3=\"Global Max\"),\"Global Max\",IF(OR(B2=\"Global Plus\",B3=\"Global Plus\"),\"Global Plus\",\"Global\")))","v":""},{"$f":"IF(AND(C2=\"\",C3=\"\"),\"\",IF(OR(C2=\"Global Max\",C3=\"Global Max\"),\"Global Max\",IF(OR(C2=\"Global Plus\",C3=\"Global Plus\"),\"Global Plus\",\"Global\")))","v":""},"","","","","","","","","","","","",""]
["Indices",{"$f":"IFERROR(VLOOKUP(B4,Clusters!$T$2:$U$4,2,FALSE),\"\")","v":""},{"$f":"IFERROR(VLOOKUP(C4,Clusters!$T$2:$U$4,2,FALSE),\"\")","v":""},{"$f":"IFERROR(VLOOKUP(D4,Clusters!$T$2:$U$4,2,FALSE),\"\")","v":""},{"$f":"IFERROR(VLOOKUP(E4,Clusters!$T$2:$U$4,2,FALSE),\"\")","v":""},{"$f":"IFERROR(VLOOKUP(F4,Clusters!$T$2:$U$4,2,FALSE),\"\")","v":""},{"$f":"IFERROR(VLOOKUP(G4,Clusters!$T$2:$U$4,2,FALSE),\"\")","v":""},{"$f":"IFERROR(VLOOKUP(H4,Clusters!$T$2:$U$4,2,FALSE),\"\")","v":""},{"$f":"IFERROR(VLOOKUP(I4,Clusters!$T$2:$U$4,2,FALSE),\"\")","v":""},{"$f":"IFERROR(VLOOKUP(J4,Clusters!$T$2:$U$4,2,FALSE),\"\")","v":""},{"$f":"IFERROR(VLOOKUP(K4,Clusters!$T$2:$U$4,2,FALSE),\"\")","v":""},{"$f":"IFERROR(VLOOKUP(L4,Clusters!$T$2:$U$4,2,FALSE),\"\")","v":""},{"$f":"IFERROR(VLOOKUP(M4,Clusters!$T$2:$U$4,2,FALSE),\"\")","v":""},{"$f":"IFERROR(VLOOKUP(N4,Clusters!$T$2:$U$4,2,FALSE),\"\")","v":""},{"$f":"IFERROR(VLOOKUP(O4,Clusters!$T$2:$U$4,2,FALSE),\"\")","v":""},{"$f":"IFERROR(VLOOKUP(P4,Clusters!$T$2:$U$4,2,FALSE),\"\")","v":""}]

{"sheet":"Indice EP","index":3,"n_rows":3,"n_cols":15,"rows_kept":3,"hidden":true}
["du 1er janvier \nau 6 janvier","du 7 janvier \nau 10 février","du 11 février \nau 10 mars","du 11 mars \nau 7 avril","du 8 avril  \nau 28 avril","du 29 avril \nau 12 mai","du 13 mai \nau 30 juin","du 1er juillet \nau 14 juillet","du 15 juillet \nau 28 juillet","du 29 juillet \nau 18 août","du 19 août \nau 1er septembre","du 2 septembre au 20 octobre","du 21 octobre au 3 novembre","du 4 novembre au 22 décembre","du 23 décembre au 31 décembre"]
[{"$f":"IF('Simulateur 2019 NRJ Global'!C38=\"\",\"\",'Simulateur 2019 NRJ Global'!C38*102+(1-'Simulateur 2019 NRJ Global'!C38)*100)","v":""},{"$f":"IF('Simulateur 2019 NRJ Global'!D38=\"\",\"\",'Simulateur 2019 NRJ Global'!D38*102+(1-'Simulateur 2019 NRJ Global'!D38)*100)","v":""},{"$f":"IF('Simulateur 2019 NRJ Global'!E38=\"\",\"\",'Simulateur 2019 NRJ Global'!E38*102+(1-'Simulateur 2019 NRJ Global'!E38)*100)","v":""},{"$f":"IF('Simulateur 2019 NRJ Global'!F38=\"\",\"\",'Simulateur 2019 NRJ Global'!F38*102+(1-'Simulateur 2019 NRJ Global'!F38)*100)","v":""},{"$f":"IF('Simulateur 2019 NRJ Global'!G38=\"\",\"\",'Simulateur 2019 NRJ Global'!G38*102+(1-'Simulateur 2019 NRJ Global'!G38)*100)","v":""},{"$f":"IF('Simulateur 2019 NRJ Global'!H38=\"\",\"\",'Simulateur 2019 NRJ Global'!H38*102+(1-'Simulateur 2019 NRJ Global'!H38)*100)","v":""},{"$f":"IF('Simulateur 2019 NRJ Global'!I38=\"\",\"\",'Simulateur 2019 NRJ Global'!I38*102+(1-'Simulateur 2019 NRJ Global'!I38)*100)","v":""},{"$f":"IF('Simulateur 2019 NRJ Global'!J38=\"\",\"\",'Simulateur 2019 NRJ Global'!J38*102+(1-'Simulateur 2019 NRJ Global'!J38)*100)","v":""},{"$f":"IF('Simulateur 2019 NRJ Global'!K38=\"\",\"\",'Simulateur 2019 NRJ Global'!K38*102+(1-'Simulateur 2019 NRJ Global'!K38)*100)","v":""},{"$f":"IF('Simulateur 2019 NRJ Global'!L38=\"\",\"\",'Simulateur 2019 NRJ Global'!L38*102+(1-'Simulateur 2019 NRJ Global'!L38)*100)","v":""},{"$f":"IF('Simulateur 2019 NRJ Global'!M38=\"\",\"\",'Simulateur 2019 NRJ Global'!M38*102+(1-'Simulateur 2019 NRJ Global'!M38)*100)","v":""},{"$f":"IF('Simulateur 2019 NRJ Global'!N38=\"\",\"\",'Simulateur 2019 NRJ Global'!N38*102+(1-'Simulateur 2019 NRJ Global'!N38)*100)","v":""},{"$f":"IF('Simulateur 2019 NRJ Global'!O38=\"\",\"\",'Simulateur 2019 NRJ Global'!O38*102+(1-'Simulateur 2019 NRJ Global'!O38)*100)","v":""},{"$f":"IF('Simulateur 2019 NRJ Global'!P38=\"\",\"\",'Simulateur 2019 NRJ Global'!P38*102+(1-'Simulateur 2019 NRJ Global'!P38)*100)","v":""},{"$f":"IF('Simulateur 2019 NRJ Global'!Q38=\"\",\"\",'Simulateur 2019 NRJ Global'!Q38*102+(1-'Simulateur 2019 NRJ Global'!Q38)*100)","v":""}]
[{"$f":"IF(AND('Simulateur 2019 NRJ Global'!C32<>\"\",'Simulateur 2019 NRJ Global'!C38=\"\"),1,0)","v":0},{"$f":"IF(AND('Simulateur 2019 NRJ Global'!D32<>\"\",'Simulateur 2019 NRJ Global'!D38=\"\"),1,0)","v":0},{"$f":"IF(AND('Simulateur 2019 NRJ Global'!E32<>\"\",'Simulateur 2019 NRJ Global'!E38=\"\"),1,0)","v":0},{"$f":"IF(AND('Simulateur 2019 NRJ Global'!F32<>\"\",'Simulateur 2019 NRJ Global'!F38=\"\"),1,0)","v":0},{"$f":"IF(AND('Simulateur 2019 NRJ Global'!G32<>\"\",'Simulateur 2019 NRJ Global'!G38=\"\"),1,0)","v":0},{"$f":"IF(AND('Simulateur 2019 NRJ Global'!H32<>\"\",'Simulateur 2019 NRJ Global'!H38=\"\"),1,0)","v":0},{"$f":"IF(AND('Simulateur 2019 NRJ Global'!I32<>\"\",'Simulateur 2019 NRJ Global'!I38=\"\"),1,0)","v":0},{"$f":"IF(AND('Simulateur 2019 NRJ Global'!J32<>\"\",'Simulateur 2019 NRJ Global'!J38=\"\"),1,0)","v":0},{"$f":"IF(AND('Simulateur 2019 NRJ Global'!K32<>\"\",'Simulateur 2019 NRJ Global'!K38=\"\"),1,0)","v":0},{"$f":"IF(AND('Simulateur 2019 NRJ Global'!L32<>\"\",'Simulateur 2019 NRJ Global'!L38=\"\"),1,0)","v":0},{"$f":"IF(AND('Simulateur 2019 NRJ Global'!M32<>\"\",'Simulateur 2019 NRJ Global'!M38=\"\"),1,0)","v":0},{"$f":"IF(AND('Simulateur 2019 NRJ Global'!N32<>\"\",'Simulateur 2019 NRJ Global'!N38=\"\"),1,0)","v":0},{"$f":"IF(AND('Simulateur 2019 NRJ Global'!O32<>\"\",'Simulateur 2019 NRJ Global'!O38=\"\"),1,0)","v":0},{"$f":"IF(AND('Simulateur 2019 NRJ Global'!P32<>\"\",'Simulateur 2019 NRJ Global'!P38=\"\"),1,0)","v":0},{"$f":"IF(AND('Simulateur 2019 NRJ Global'!Q32<>\"\",'Simulateur 2019 NRJ Global'!Q38=\"\"),1,0)","v":0}]

{"sheet":"Simulateur 2019 NRJ Global","index":4,"n_rows":53,"n_cols":17,"rows_kept":53,"merged":[[2,2,2,4],[2,7,2,8],[44,3,44,4],[45,3,45,4]]}
[null,"Simulateur 2019 - Ct GRP net net garanti"]
[]
[null,"Cible:","Femmes 25-49 ans",{"$nulls":3},"Annonceur:"]
[]
[null,"Cluster cible garantie:",{"$f":"VLOOKUP(C3,Clusters!$A:$D,4,FALSE)","v":"Femmes"}]
[]
[null,"Ct GRP base 100:"]
[]
[]
[null,"Sélection des chaînes définie par la régie, sinon précisez:"]
[]
[]
[]
[null,"Disponibilité",{"$f":"VLOOKUP($C$3,Clusters!$A:$M,9,FALSE)","v":"R"},{"$f":"VLOOKUP($C$3,Clusters!$A:$M,10,FALSE)","v":"R"},{"$f":"VLOOKUP($C$3,Clusters!$A:$M,11,FALSE)","v":"R"}]
[null,"Sélection chaîne (oui/non)","oui","oui","oui"]
{"$rows_left_out":38}